Dado Rail
type: Concept
in scheme: element
notation: element.dado_rail
definition: The horizontal moulding at chair-back height, splitting the wall into dado and field.
alternative label: chair rail
related: internal wall
relation:
  predicate: part-of
  target: internal wall
semantic id: element.dado-rail
source basis: authored
source: @instruments/taxonomy ADR 0001