Curtain Walling
type: Concept
in scheme: element
notation: element.curtain_walling
definition: A non-loadbearing external wall hung off the structure as a continuous glazed skin.
alternative label: curtain wall
broader: external wall
broad match: EF 25 10 25
semantic id: element.curtain-walling
source basis: authored
source: @instruments/taxonomy ADR 0001