Cornice
type: Concept
in scheme: element
notation: element.cornice
definition: The moulded band at the wall-to-ceiling junction; a plain quadrant in that position is coving.
alternative label: coving
alternative label: crown moulding
related: internal wall
relation:
  predicate: part-of
  target: internal wall
semantic id: element.cornice
source basis: authored
source: @instruments/taxonomy ADR 0001