Beam
type: Concept
in scheme: element
notation: element.beam
definition: A horizontal structural member spanning between supports and carrying load in bending.
alternative label: joist
alternative label: girder
related match: EF 20 10 30
semantic id: element.beam
source basis: authored
source: @instruments/taxonomy ADR 0001